
> Compilation Started...
> ADAU146xSchematic_0: Compilation of the schematic started...
> SingleLevelDetectorRunningAvg_0: error (12,SingleLevelDetectorRunningAvg_0): Invalid arithmetic constant, must be ONE, fractional ('1' or '1.0'), or integer 'LSB' (592,9)
> SingleLevelDetectorRunningAvg_0: error (13,SingleLevelDetectorRunningAvg_0): Unrecognized instruction, ';' (593,11)
> ADAU146xSchematic_0: Compilation FAILED:  2 errors, 0 warnings
	DM0 RAM used:		00074    (of 40960)
	DM1 RAM used:		00029    (of 40960)
	PM  RAM used(Data):	00000    (of 24576)
	PM  RAM used(Inst):	00196    (of 24576) 171 instructions (32bit: 146  64bit: 25)
	Total PM used:		00196    (of 24576)

> ADAU146xSchematic_0: 
Files written: (C:\Users\hohensohn\Documents\Analog Devices\SigmaStudio 2.0\ADAU1467 Audio Mixing and Splitting Example\ADAU146xSchematic_0/)
----------------------------------------------------
	compiler_output.log: 	compiler output report
	report.dat:   		#report/#report_text output

> ADAU146xSchematic_0 - SigmaDSP compilation 2 errors, 0 warnings found.
> Project Compilation failed
