
> Compilation Started...
> ADAU145xSchematic_0: Compilation of the schematic started...
> PulseGen_0: error (19,PulseGen_0): Invalid arithmetic constant, must be ONE, fractional ('1' or '1.0'), or integer 'LSB' (408,14)
> PulseGen_0: error (20,PulseGen_0): Unrecognized instruction, ';' (409,14)
> ADAU145xSchematic_0: Compilation FAILED:  2 errors, 0 warnings
	DM0 RAM used:		00028    (of 20480)
	DM1 RAM used:		00013    (of 20480)
	PM  RAM used(Data):	00000    (of 8192)
	PM  RAM used(Inst):	00093    (of 8192) 83 instructions (32bit: 73  64bit: 10)
	Total PM used:		00093    (of 8192)

> ADAU145xSchematic_0: 
Files written: (C:\Users\hohensohn\Documents\Analog Devices\SigmaStudio 2.0\pulsegen\ADAU145xSchematic_0/)
----------------------------------------------------
	compiler_output.log: 	compiler output report
	report.dat:   		#report/#report_text output

> ADAU145xSchematic_0 - SigmaDSP compilation 2 errors, 0 warnings found.
> Project Compilation failed
